Target
Bromodomain-containing protein 7
Ligand
BDBM50183449
Substrate
Meas. Tech.
ChEMBL_1586793 (CHEMBL3826478)
IC50
3410±n/a nM
Citation
 Martin, LJKoegl, MBader, GCockcroft, XLFedorov, OFiegen, DGerstberger, THofmann, MHHohmann, AFKessler, DKnapp, SKnesl, PKornigg, SMüller, SNar, HRogers, CRumpel, KSchaaf, OSteurer, STallant, CVakoc, CRZeeb, MZoephel, APearson, MBoehmelt, GMcConnell, D Structure-Based Design of an in Vivo Active Selective BRD9 Inhibitor. J Med Chem 59:4462-75 (2016)  
Target
Name:
Bromodomain-containing protein 7
Synonyms:
75 kDa bromodomain protein BRD7 CELTIX1 | Protein CELTIX-1
Type:
PROTEIN
Mol. Mass.:
74135.71
Organism:
Homo sapiens (Human)
Description:
ChEMBL_107970
Residue:
651
  
Inhibitor
Name:
BDBM50183449
Synonyms:
CHEMBL3823101 | US11773085, Compound B23
Type:
Small organic molecule
Emp. Form.:
C20H23N3O3
Mol. Mass.:
353.4149
SMILES:
COc1cc(c(OC)cc1CN(C)C)-c1cn(C)c(=O)c2cnccc12
: