Target
Cyclin-dependent kinase 7
Ligand
BDBM50184461
Substrate
Meas. Tech.
ChEMBL_1587011 (CHEMBL3825311)
IC50
300±n/a nM
Citation
 Degorce, SLBoyd, SCurwen, JODucray, RHalsall, CTJones, CDLach, FLenz, EMPass, MPass, STrigwell, C Discovery of a Potent, Selective, Orally Bioavailable, and Efficacious Novel 2-(Pyrazol-4-ylamino)-pyrimidine Inhibitor of the Insulin-like Growth Factor-1 Receptor (IGF-1R). J Med Chem 59:4859-66 (2016)  
Target
Name:
Cyclin-dependent kinase 7
Synonyms:
39 kDa protein kinase CAK1 CDK-activating kinase 1 (CAK) CDK7_HUMAN Cell division protein kinase 7 Cyclin-dependent kinase 7 (CDK7/cyclin H) P39 Mo15 TFIIH basal transcription factor complex kinase subunit
Type:
Enzyme Subunit
Mol. Mass.:
39047.01
Organism:
Homo sapiens (Human)
Description:
Residue:
346
  
Inhibitor
Name:
BDBM50184461
Synonyms:
CHEMBL3823030
Type:
Small organic molecule
Emp. Form.:
C24H27ClN8O2
Mol. Mass.:
494.977
SMILES:
C[C@@H](O)C(=O)N1CCC(CC1)n1nc(C)c(Nc2ncc(Cl)c(n2)-c2cnn3ccccc23)c1C
: