Target
ATP-dependent translocase ABCB1
Ligand
BDBM50185048
Substrate
Meas. Tech.
ChEMBL_1587212 (CHEMBL3825948)
IC50
73±n/a nM
Citation
 Chen, CYLiu, NYLin, HCLee, CYHung, CCChang, CS Synthesis and bioevaluation of novel benzodipyranone derivatives as P-glycoprotein inhibitors for multidrug resistance reversal agents. Eur J Med Chem 118:219-29 (2016)  
Target
Name:
ATP-dependent translocase ABCB1
Synonyms:
ABCB1 MDR1_HUMAN Multidrug resistance protein 1 P-glycoprotein (P-gp) PGY1
Type:
Protein
Mol. Mass.:
141503.50
Organism:
Homo sapiens (Human)
Description:
P08183
Residue:
1280
  
Inhibitor
Name:
BDBM50185048
Synonyms:
CHEMBL3822838
Type:
Small organic molecule
Emp. Form.:
C28H22O9
Mol. Mass.:
502.4689
SMILES:
COc1ccc(cc1OC)-c1coc2c(c(O)cc3occ(-c4ccc(OC)c(OC)c4)c(=O)c23)c1=O
: