Target
ATP-dependent translocase ABCB1
Ligand
BDBM50185028
Substrate
Meas. Tech.
ChEMBL_1587212 (CHEMBL3825948)
IC50
60±n/a nM
Citation
 Chen, CYLiu, NYLin, HCLee, CYHung, CCChang, CS Synthesis and bioevaluation of novel benzodipyranone derivatives as P-glycoprotein inhibitors for multidrug resistance reversal agents. Eur J Med Chem 118:219-29 (2016)  
Target
Name:
ATP-dependent translocase ABCB1
Synonyms:
ABCB1 MDR1_HUMAN Multidrug resistance protein 1 P-glycoprotein (P-gp) PGY1
Type:
Protein
Mol. Mass.:
141503.50
Organism:
Homo sapiens (Human)
Description:
P08183
Residue:
1280
  
Inhibitor
Name:
BDBM50185028
Synonyms:
CHEMBL3823024
Type:
Small organic molecule
Emp. Form.:
C26H18O5
Mol. Mass.:
410.4181
SMILES:
Cc1cccc(c1)-c1coc2c(c(O)cc3occ(-c4cccc(C)c4)c(=O)c23)c1=O
: