Target
Prostaglandin G/H synthase 1
Ligand
BDBM50185055
Substrate
Meas. Tech.
ChEMBL_1587239 (CHEMBL3826055)
IC50
9800±n/a nM
Citation
 Abdelall, EKKamel, GM Synthesis of new thiazolo-celecoxib analogues as dual cyclooxygenase-2/15-lipoxygenase inhibitors: Determination of regio-specific different pyrazole cyclization by 2D NMR. Eur J Med Chem 118:250-8 (2016)  
Target
Name:
Prostaglandin G/H synthase 1
Synonyms:
COX1 Cyclooxygenase-1 (COX-1) PTGS1 | Prostaglandin G/H synthase (cyclooxygenase)
Type:
Protein
Mol. Mass.:
68868.60
Organism:
Ovis aries (Sheep)
Description:
Residue:
600
  
Inhibitor
Name:
BDBM50185055
Synonyms:
CHEMBL3822900
Type:
Small organic molecule
Emp. Form.:
C19H16N4O2S2
Mol. Mass.:
396.486
SMILES:
Cc1nc(sc1-c1ccnn1-c1ccc(cc1)S(N)(=O)=O)-c1ccccc1
: