Target
Insulin-like growth factor 1 receptor
Ligand
BDBM50185196
Substrate
Meas. Tech.
ChEMBL_1587417 (CHEMBL3824710)
IC50
52±n/a nM
Citation
 Huang, WSLiu, SZou, DThomas, MWang, YZhou, TRomero, JKohlmann, ALi, FQi, JCai, LDwight, TAXu, YXu, RDodd, RToms, AParillon, LLu, XAnjum, RZhang, SWang, FKeats, JWardwell, SDNing, YXu, QMoran, LEMohemmad, QKJang, HGClackson, TNarasimhan, NIRivera, VMZhu, XDalgarno, DShakespeare, WC Discovery of Brigatinib (AP26113), a Phosphine Oxide-Containing, Potent, Orally Active Inhibitor of Anaplastic Lymphoma Kinase. J Med Chem 59:4948-64 (2016)  
Target
Name:
Insulin-like growth factor 1 receptor
Synonyms:
CD_antigen=CD221 IGF1R Insulin-like growth factor 1 receptor (IGF1R) Insulin-like growth factor 1 receptor alpha chain Insulin-like growth factor I receptor | Insulin-like growth factor receptor (IGFR)
Type:
Protein
Mol. Mass.:
154776.79
Organism:
Homo sapiens (Human)
Description:
P08069
Residue:
1367
  
Inhibitor
Name:
BDBM50185196
Synonyms:
CHEMBL3824185
Type:
Small organic molecule
Emp. Form.:
C27H34ClN7O
Mol. Mass.:
508.058
SMILES:
COc1cc(ccc1Nc1ncc(Cl)c(Nc2ccccc2)n1)N1CCC(CC1)N1CCN(C)CC1
: