Target
Carbonic anhydrase 9
Ligand
BDBM10880
Substrate
Meas. Tech.
ChEMBL_1587515 (CHEMBL3825324)
Ki
25±n/a nM
Citation
 Akocak, SAlam, MRShabana, AMSanku, RKVullo, DThompson, HSwenson, ERSupuran, CTIlies, MA PEGylated Bis-Sulfonamide Carbonic Anhydrase Inhibitors Can Efficiently Control the Growth of Several Carbonic Anhydrase IX-Expressing Carcinomas. J Med Chem 59:5077-88 (2016)  
Target
Name:
Carbonic anhydrase 9
Synonyms:
CA-IX CAH9_HUMAN Carbonic anhydrase 9 (CA IX) Carbonic anhydrase 9 precursor Carbonic anhydrase IX (CAIX) Carbonic anhydrases; II & IX MN RCC-associated antigen G250
Type:
Enzyme
Mol. Mass.:
49669.03
Organism:
Homo sapiens (Human)
Description:
Catalytic domain of human cloned isozyme was used in the assay
Residue:
459
  
Inhibitor
Name:
BDBM10880
Synonyms:
AZA AZM acetazolamide Acetazolamide Acetazolamide (AZA) Acetazolamide, 5 Acetazolamide, AZA CHEMBL20 Sulfonamide, 1 US11278534, Example acetazolamide sulfonamide 1
Type:
Small organic molecule
Emp. Form.:
C4H6N4O3S2
Mol. Mass.:
222.245
SMILES:
CC(=O)Nc1nnc(s1)S(N)(=O)=O
: