Target
Cytochrome P450 2B6
Ligand
BDBM85509
Substrate
Meas. Tech.
ChEMBL_1587700 (CHEMBL3825880)
IC50
600±n/a nM
Citation
 Smutny, TNova, ADrechslerová, MCarazo, AHyrsova, LHru?ková, ZRKune?, JPour, M?pulák, MPavek, P 2-(3-Methoxyphenyl)quinazoline Derivatives: A New Class of Direct Constitutive Androstane Receptor (CAR) Agonists. J Med Chem 59:4601-10 (2016)  
Target
Name:
Cytochrome P450 2B6
Synonyms:
CP2B6_HUMAN Cytochrome P450 2B6 (CYP2B6)
Type:
Protein
Mol. Mass.:
56289.75
Organism:
Homo sapiens (Human)
Description:
P20813
Residue:
491
  
Inhibitor
Name:
BDBM85509
Synonyms:
CAS_55142-85-3 Ticlopidine
Type:
Small organic molecule
Emp. Form.:
C14H14ClNS
Mol. Mass.:
263.786
SMILES:
Clc1ccccc1CN1CCc2sccc2C1
: