Target
Hepatocyte growth factor receptor
Ligand
BDBM50185480
Substrate
Meas. Tech.
ChEMBL_1588142 (CHEMBL3825518)
IC50
>20000±n/a nM
Citation
 Mohyeldin, MMBusnena, BAAkl, MRDragoi, AMCardelli, JAEl Sayed, KA Novel c-Met inhibitory olive secoiridoid semisynthetic analogs for the control of invasive breast cancer. Eur J Med Chem 118:299-315 (2016)  
Target
Name:
Hepatocyte growth factor receptor
Synonyms:
Hepatocyte growth factor receptor Hepatocyte growth factor receptor (c-MET) MET Met proto-oncogene (hepatocyte growth factor receptor) Tyrosine-protein kinase Met (c-Met) c-Met kinase
Type:
Protein
Mol. Mass.:
155559.73
Organism:
Homo sapiens (Human)
Description:
P08581
Residue:
1390
  
Inhibitor
Name:
BDBM50185480
Synonyms:
CHEMBL3823683
Type:
Small organic molecule
Emp. Form.:
C19H22O7
Mol. Mass.:
362.3738
SMILES:
COC(=O)C1=CO[C@@H](C)[C@@H](C=O)[C@@H]1CC(=O)OCCc1ccc(O)cc1
: