Target
Hepatocyte growth factor receptor
Ligand
BDBM50185656
Substrate
Meas. Tech.
ChEMBL_1588142 (CHEMBL3825518)
IC50
>20000±n/a nM
Citation
 Mohyeldin, MMBusnena, BAAkl, MRDragoi, AMCardelli, JAEl Sayed, KA Novel c-Met inhibitory olive secoiridoid semisynthetic analogs for the control of invasive breast cancer. Eur J Med Chem 118:299-315 (2016)  
Target
Name:
Hepatocyte growth factor receptor
Synonyms:
Hepatocyte growth factor receptor Hepatocyte growth factor receptor (c-MET) MET Met proto-oncogene (hepatocyte growth factor receptor) Tyrosine-protein kinase Met (c-Met) c-Met kinase
Type:
Protein
Mol. Mass.:
155559.73
Organism:
Homo sapiens (Human)
Description:
P08581
Residue:
1390
  
Inhibitor
Name:
BDBM50185656
Synonyms:
CHEMBL3823798
Type:
Small organic molecule
Emp. Form.:
C20H22O6
Mol. Mass.:
358.3851
SMILES:
COc1cc(\C=C/C(=O)OCCc2ccc(OC)c(OC)c2)ccc1O
: