Target
Mitogen-activated protein kinase kinase kinase 7
Ligand
BDBM50187107
Substrate
Meas. Tech.
ChEMBL_1587762 (CHEMBL3826003)
IC50
5.2±n/a nM
Citation
 Muraoka, TIde, MMorikami, KIrie, MNakamura, MMiura, TKamikawa, TNishihara, MKashiwagi, H Discovery of a potent and highly selective transforming growth factorß receptor-associated kinase 1 (TAK1) inhibitor by structure based drug design (SBDD). Bioorg Med Chem 24:4206-4217 (2016)  
Target
Name:
Mitogen-activated protein kinase kinase kinase 7
Synonyms:
M3K7_HUMAN Mitogen-activated protein kinase kinase kinase 7 TAK1/TAB1 Transforming growth factor-beta-activated kinase 1 (TAK1)
Type:
Protein
Mol. Mass.:
67199.89
Organism:
Homo sapiens (Human)
Description:
O43318
Residue:
606
  
Inhibitor
Name:
BDBM50187107
Synonyms:
CHEMBL3822712
Type:
Small organic molecule
Emp. Form.:
C22H19F6N5O4S
Mol. Mass.:
563.473
SMILES:
CN1CCN(CC1)C(=O)c1ccc(NC(=O)c2csc3c2nc[nH]c3=O)c(OC(C(F)(F)F)C(F)(F)F)c1
: