Target
Acetylcholinesterase
Ligand
BDBM50187213
Substrate
Meas. Tech.
ChEMBL_1589694 (CHEMBL3829849)
IC50
770000±n/a nM
Citation
 Karade, HNRaviraju, GAcharya, BNValiveti, AKBhalerao, UAcharya, J Synthesis and in vitro reactivation study of isonicotinamide derivatives of 2-(hydroxyimino)-N-(pyridin-3-yl)acetamide as reactivators of Sarin and VX inhibited human acetylcholinesterase (hAChE). Bioorg Med Chem 24:4171-4176 (2016)  
Target
Name:
Acetylcholinesterase
Synonyms:
ACES_HUMAN Acetylcholinesterase (AChE) | Acetylcholinesterase (human AChE)
Type:
Enzyme
Mol. Mass.:
67792.70
Organism:
Homo sapiens (Human)
Description:
P22303
Residue:
614
  
Inhibitor
Name:
BDBM50187213
Synonyms:
CHEMBL3828586
Type:
Small organic molecule
Emp. Form.:
C18H23Br2N5O3
Mol. Mass.:
517.215
SMILES:
[Br-].[Br-].NC(=O)c1cc[n+](CCCCC[n+]2cccc(NC(=O)\C=N/O)c2)cc1
: