Target
Fatty acid-binding protein, heart
Ligand
BDBM22231
Substrate
Meas. Tech.
ChEMBL_1590015 (CHEMBL3828901)
Ki
9300±n/a nM
Citation
 Zhou, YNie, TZhang, YSong, MLi, KDing, MDing, KWu, DXu, Y The discovery of novel and selective fatty acid binding protein 4 inhibitors by virtual screening and biological evaluation. Bioorg Med Chem 24:4310-4317 (2016)  
Target
Name:
Fatty acid-binding protein, heart
Synonyms:
FABP11 FABPH_HUMAN MDGI
Type:
PROTEIN
Mol. Mass.:
14858.36
Organism:
Homo sapiens (Human)
Description:
ChEMBL_1463784
Residue:
133
  
Inhibitor
Name:
BDBM22231
Synonyms:
(9Z,12Z)-octadeca-9,12-dienoic acid Linoleic Acid | Linoleic acid (LA)
Type:
Unsaturated fatty acid
Emp. Form.:
C18H32O2
Mol. Mass.:
280.4455
SMILES:
CCCCC\C=C/C\C=C/CCCCCCCC(O)=O
: