Target
Polyphenol oxidase 2
Ligand
BDBM26189
Substrate
Meas. Tech.
ChEMBL_1590349 (CHEMBL3830497)
IC50
652000±n/a nM
Citation
 Garcia-Jimenez, ATeruel-Puche, JABerna, JRodriguez-Lopez, JNTudela, JGarcia-Ruiz, PAGarcia-Canovas, F Characterization of the action of tyrosinase on resorcinols. Bioorg Med Chem 24:4434-4443 (2016)  
Target
Name:
Polyphenol oxidase 2
Synonyms:
Monophenol monooxygenase PPO2 Tyrosinase
Type:
Protein
Mol. Mass.:
63923.66
Organism:
Agaricus bisporus (Common mushroom)
Description:
O42713
Residue:
556
  
Inhibitor
Name:
BDBM26189
Synonyms:
α-CA inhibitor, 13 1,3-dihydroxybenzene US9688816, 4 phenol derivative, 3
Type:
Small organic molecule
Emp. Form.:
C6H6O2
Mol. Mass.:
110.1106
SMILES:
Oc1cccc(O)c1
: