Target
Adenosine receptor A2b
Ligand
BDBM50187586
Substrate
Meas. Tech.
ChEMBL_1590505 (CHEMBL3831087)
Ki
>1000±n/a nM
Citation
 Szymanska, EDrabczynska, AKarcz, TMüller, CEKöse, MKarolak-Wojciechowska, JFruzinski, ASchabikowski, JDoroz-Plonka, AHandzlik, JKiec-Kononowicz, K Similarities and differences in affinity and binding modes of tricyclic pyrimido- and pyrazinoxanthines at human and rat adenosine receptors. Bioorg Med Chem 24:4347-4362 (2016)  
Target
Name:
Adenosine receptor A2b
Synonyms:
AA2BR_RAT Adora2b
Type:
PROTEIN
Mol. Mass.:
36378.84
Organism:
Rattus norvegicus
Description:
ChEMBL_32934
Residue:
332
  
Inhibitor
Name:
BDBM50187586
Synonyms:
CHEMBL3827623
Type:
Small organic molecule
Emp. Form.:
C26H36N6O3
Mol. Mass.:
480.6024
SMILES:
CCCn1c2nc3N(CCCn3c2c(=O)n(CCC)c1=O)c1ccc(OCCN2CCCC2)cc1
: