Target
Ectonucleotide pyrophosphatase/phosphodiesterase family member 2
Ligand
BDBM50187690
Substrate
Meas. Tech.
ChEMBL_1591230 (CHEMBL3829622)
IC50
2.6±n/a nM
Citation
 Castagna, DBudd, DCMacdonald, SJJamieson, CWatson, AJ Development of Autotaxin Inhibitors: An Overview of the Patent and Primary Literature. J Med Chem 59:5604-21 (2016)  
Target
Name:
Ectonucleotide pyrophosphatase/phosphodiesterase family member 2
Synonyms:
ATX Autotaxin (ATX) ENPP2 Ectonucleotide Pyrophosphatase/Phosphodiesterase 2 (ENPP2) Extracellular lysophospholipase D PDNP2
Type:
Enzyme
Mol. Mass.:
99007.13
Organism:
Homo sapiens (Human)
Description:
Q13822
Residue:
863
  
Inhibitor
Name:
BDBM50187690
Synonyms:
CHEMBL3827088
Type:
Small organic molecule
Emp. Form.:
C24H21FN4OS
Mol. Mass.:
432.513
SMILES:
Fc1ccc(Cc2ncnc3CCN(Cc23)C(=O)CCc2nc3ccccc3s2)cc1
: