Target
4,4'-diapophytoene desaturase (4,4'-diaponeurosporene-forming)
Ligand
BDBM50187728
Substrate
Meas. Tech.
ChEMBL_1589616 (CHEMBL3829511)
IC50
500±n/a nM
Citation
 Wang, YDi, HChen, FXu, YXiao, QWang, XWei, HLu, YZhang, LZhu, JLan, LLi, J Discovery of Benzocycloalkane Derivatives Efficiently Blocking Bacterial Virulence for the Treatment of Methicillin-Resistant S. aureus (MRSA) Infections by Targeting Diapophytoene Desaturase (CrtN). J Med Chem 59:4831-48 (2016)  
Target
Name:
4,4'-diapophytoene desaturase (4,4'-diaponeurosporene-forming)
Synonyms:
4,4'-diapophytoene desaturase Dehydrosqualene desaturase crtN
Type:
PROTEIN
Mol. Mass.:
56731.85
Organism:
Staphylococcus aureus (strain Newman)
Description:
ChEMBL_116799
Residue:
502
  
Inhibitor
Name:
BDBM50187728
Synonyms:
CHEMBL3828585
Type:
Small organic molecule
Emp. Form.:
C22H25ClF3N
Mol. Mass.:
395.889
SMILES:
Cl.CN(C\C=C\c1ccc(cc1)C(F)(F)F)Cc1ccc2CCCCc2c1
: