Target
4,4'-diapophytoene desaturase (4,4'-diaponeurosporene-forming)
Ligand
BDBM50188228
Substrate
Meas. Tech.
ChEMBL_1589615 (CHEMBL3829384)
IC50
>20000±n/a nM
Citation
 Wang, YDi, HChen, FXu, YXiao, QWang, XWei, HLu, YZhang, LZhu, JLan, LLi, J Discovery of Benzocycloalkane Derivatives Efficiently Blocking Bacterial Virulence for the Treatment of Methicillin-Resistant S. aureus (MRSA) Infections by Targeting Diapophytoene Desaturase (CrtN). J Med Chem 59:4831-48 (2016)  
Target
Name:
4,4'-diapophytoene desaturase (4,4'-diaponeurosporene-forming)
Synonyms:
4,4'-diapophytoene desaturase Dehydrosqualene desaturase crtN
Type:
PROTEIN
Mol. Mass.:
56731.85
Organism:
Staphylococcus aureus (strain Newman)
Description:
ChEMBL_116799
Residue:
502
  
Inhibitor
Name:
BDBM50188228
Synonyms:
CHEMBL3827355
Type:
Small organic molecule
Emp. Form.:
C21H24O
Mol. Mass.:
292.4147
SMILES:
C(OCc1ccc2CCCCCc2c1)\C=C\c1ccccc1
: