Target
Adenosine receptor A3
Ligand
BDBM50189050
Substrate
Meas. Tech.
ChEMBL_1591033 (CHEMBL3831118)
Ki
8630±n/a nM
Citation
 Bharate, SBSingh, BKachler, SOliveira, AKumar, VBharate, SSVishwakarma, RAKlotz, KNGutiérrez de Terán, H Discovery of 7-(Prolinol-N-yl)-2-phenylamino-thiazolo[5,4-d]pyrimidines as Novel Non-Nucleoside Partial Agonists for the A2A Adenosine Receptor: Prediction from Molecular Modeling. J Med Chem 59:5922-8 (2016)  
Target
Name:
Adenosine receptor A3
Synonyms:
A3 adenosine receptor (hA3) ADORA3 | Adenosine A3 receptor (A3AR)
Type:
G Protein-Coupled Receptor (GPCR)
Mol. Mass.:
36197.32
Organism:
Homo sapiens (Human)
Description:
P0DMS8
Residue:
318
  
Inhibitor
Name:
BDBM50189050
Synonyms:
CHEMBL3827207
Type:
Small organic molecule
Emp. Form.:
C15H15N5S
Mol. Mass.:
297.378
SMILES:
C1CCN(C1)c1ncnc2sc(Nc3ccccc3)nc12
: