Target
Cholinesterase
Ligand
BDBM10922
Substrate
Meas. Tech.
ChEMBL_1589179 (CHEMBL3829834)
IC50
0.690000±n/a nM
Citation
 Montanari, SScalvini, LBartolini, MBelluti, FGobbi, SAndrisano, VLigresti, ADi Marzo, VRivara, SMor, MBisi, ARampa, A Fatty Acid Amide Hydrolase (FAAH), Acetylcholinesterase (AChE), and Butyrylcholinesterase (BuChE): Networked Targets for the Development of Carbamates as Potential Anti-Alzheimer's Disease Agents. J Med Chem 59:6387-406 (2016)  
Target
Name:
Cholinesterase
Synonyms:
Acylcholine acylhydrolase Butyrylcholine esterase (BChE) Butyrylcholinesterase (BuChE) CHLE_HUMAN Cholinesterases Pseudocholinesterase
Type:
Homotetramer
Mol. Mass.:
68422.27
Organism:
Homo sapiens (Human)
Description:
P06276
Residue:
602
  
Inhibitor
Name:
BDBM10922
Synonyms:
3-({methyl[3-({5-oxo-5H-chromeno[2,3-b]pyridin-8-yl}oxy)propyl]amino}methyl)phenyl N-heptylcarbamate hydrochloride aminoalkoxyheteroaryl deriv. 15
Type:
Small organic molecule
Emp. Form.:
C31H37N3O5
Mol. Mass.:
531.6426
SMILES:
CCCCCCCNC(=O)Oc1cccc(CN(C)CCCOc2ccc3c(c2)oc2ncccc2c3=O)c1
: