Target
Cyclin-C
Ligand
BDBM50189421
Substrate
Meas. Tech.
ChEMBL_1589659 (CHEMBL3829688)
IC50
5.2±n/a nM
Citation
 Mallinger, ASchiemann, KRink, CSejberg, JHoney, MACzodrowski, PStubbs, MPoeschke, OBusch, MSchneider, RSchwarz, DMusil, DBurke, RUrbahns, KWorkman, PWienke, DClarke, PARaynaud, FIEccles, SAEsdar, CRohdich, FBlagg, J 2,8-Disubstituted-1,6-Naphthyridines and 4,6-Disubstituted-Isoquinolines with Potent, Selective Affinity for CDK8/19. ACS Med Chem Lett 7:573-8 (2016)  
Target
Name:
Cyclin-C
Synonyms:
CCNC Cyclin C hSRB11
Type:
PROTEIN
Mol. Mass.:
33244.88
Organism:
Homo sapiens (Human)
Description:
ChEMBL_107900
Residue:
283
  
Inhibitor
Name:
BDBM50189421
Synonyms:
CHEMBL3827118
Type:
Small organic molecule
Emp. Form.:
C23H21N5O2
Mol. Mass.:
399.4451
SMILES:
COC1CN(C1)C(=O)c1ccc2cncc(-c3ccc(cc3)-c3cnn(C)c3)c2n1
: