Target
Botulinum neurotoxin type E
Ligand
BDBM50189882
Substrate
Meas. Tech.
ChEMBL_1590439 (CHEMBL3830809)
IC50
9800±n/a nM
Citation
 Kumar, GAgarwal, RSwaminathan, S Small molecule non-peptide inhibitors of botulinum neurotoxin serotype E: Structure-activity relationship and a pharmacophore model. Bioorg Med Chem 24:3978-3985 (2016)  
Target
Name:
Botulinum neurotoxin type E
Synonyms:
BXE_CLOBO Bontoxilysin-E Botulinum neurotoxin E light chain botE
Type:
PROTEIN
Mol. Mass.:
143842.39
Organism:
Clostridium botulinum
Description:
ChEMBL_103941
Residue:
1251
  
Inhibitor
Name:
BDBM50189882
Synonyms:
CHEMBL3828595
Type:
Small organic molecule
Emp. Form.:
C27H13Cl4NO2
Mol. Mass.:
525.21
SMILES:
Clc1cc2Cc3cc(ccc3-c2c(Cl)c1)-n1c(=O)c2cc(Cl)ccc2c2ccc(Cl)cc2c1=O
: