Target
Carbonic anhydrase 12
Ligand
BDBM50190134
Substrate
Meas. Tech.
ChEBML_1591368
Ki
0.590000±n/a nM
Citation
 Bozdag, MAlafeefy, AMCarta, FCeruso, MAl-Tamimi, ASAl-Kahtani, AAAlasmary, FASSupuran, CT Synthesis 4-[2-(2-mercapto-4-oxo-4H-quinazolin-3-yl)-ethyl]-benzenesulfonamides with subnanomolar carbonic anhydrase II and XII inhibitory properties. Bioorg Med Chem 24:4100-4107 (2016)  
Target
Name:
Carbonic anhydrase 12
Synonyms:
CA-XII CAH12_HUMAN Carbonic anhydrase Carbonic anhydrase XII Carbonic anhydrase XII (CAXII) | Tumor antigen HOM-RCC-3.1.3
Type:
Enzyme
Mol. Mass.:
39456.00
Organism:
Homo sapiens (Human)
Description:
Catalytic domain of human cloned isozyme was used in the assay
Residue:
354
  
Inhibitor
Name:
BDBM50190134
Synonyms:
CHEMBL1433252
Type:
Small organic molecule
Emp. Form.:
C16H15N3O3S2
Mol. Mass.:
361.439
SMILES:
NS(=O)(=O)c1ccc(CCn2c(=S)[nH]c3ccccc3c2=O)cc1
: