Target
NADPH oxidase 1
Ligand
BDBM50190497
Substrate
Meas. Tech.
ChEMBL_1589207 (CHEMBL3829980)
Ki
6630±n/a nM
Citation
 Bae, YSChoi, SPark, JJJoo, JHCui, MCho, HLee, WJLee, SH Synthesis and biological evaluation of 3-substituted 5-benzylidene-1-methyl-2-thiohydantoins as potent NADPH oxidase (NOX) inhibitors. Bioorg Med Chem 24:4144-4151 (2016)  
Target
Name:
NADPH oxidase 1
Synonyms:
MOX-1 Mitogenic oxidase 1 NOH-1 NOX-1 NOX1_HUMAN
Type:
PROTEIN
Mol. Mass.:
64890.44
Organism:
Homo sapiens (Human)
Description:
ChEMBL_792877
Residue:
564
  
Inhibitor
Name:
BDBM50190497
Synonyms:
CHEMBL3827227
Type:
Small organic molecule
Emp. Form.:
C20H18N2O3S
Mol. Mass.:
366.434
SMILES:
CN1C(=S)N(C(=O)\C1=C\c1cccc(O)c1O)c1ccc2CCCc2c1
: