Target
Disintegrin and metalloproteinase domain-containing protein 8
Ligand
BDBM50190574
Substrate
Meas. Tech.
ChEMBL_1589214 (CHEMBL3829987)
IC50
1245±n/a nM
Citation
 Yim, VNoisier, AFMHung, KYBartsch, JWSchlomann, UBrimble, MA Synthesis and biological evaluation of analogues of the potent ADAM8 inhibitor cyclo(RLsKDK) for the treatment of inflammatory diseases and cancer metastasis. Bioorg Med Chem 24:4032-4037 (2016)  
Target
Name:
Disintegrin and metalloproteinase domain-containing protein 8
Synonyms:
ADAM8 MS2
Type:
PROTEIN
Mol. Mass.:
88789.34
Organism:
Homo sapiens (Human)
Description:
ChEMBL_492660
Residue:
824
  
Inhibitor
Name:
BDBM50190574
Synonyms:
CHEMBL3828603
Type:
Small organic molecule
Emp. Form.:
C32H58N12O11
Mol. Mass.:
786.8767
SMILES:
CC(C)C[C@@H]1NC(=O)[C@H](CCCNC(=N)N[N+]([O-])=O)NC(=O)[C@H](CCCCN)NC(=O)[C@H](CC(O)=O)NC(=O)[C@H](CCCCN)NC(=O)C[C@H](CO)NC1=O
: