Target
Dihydrofolate reductase
Ligand
BDBM210930
Substrate
Meas. Tech.
ChEMBL_1589520 (CHEMBL3829094)
Ki
0.910000±n/a nM
Citation
 Scocchera, EReeve, SMKeshipeddy, SLombardo, MNHajian, BSochia, AEAlverson, JBPriestley, NDAnderson, ACWright, DL Charged Nonclassical Antifolates with Activity Against Gram-Positive and Gram-Negative Pathogens. ACS Med Chem Lett 7:692-6 (2016)  
Target
Name:
Dihydrofolate reductase
Synonyms:
Dihydrofolate reductase (F31V) | dfrA17
Type:
Mol. Mass.:
17532.46
Organism:
Escherichia coli
Description:
Residue:
157
  
Inhibitor
Name:
BDBM210930
Synonyms:
UCP1173
Type:
Small organic molecule
Emp. Form.:
C24H24N4O3
Mol. Mass.:
416.4724
SMILES:
CCc1nc(N)nc(N)c1C#C[C@H](C)c1cc(OC)cc(c1)-c1ccc(cc1)C(O)=O
: