Target
Dihydrofolate reductase
Ligand
BDBM210929
Substrate
Meas. Tech.
ChEMBL_1589521 (CHEMBL3829095)
Ki
389±n/a nM
Citation
 Scocchera, EReeve, SMKeshipeddy, SLombardo, MNHajian, BSochia, AEAlverson, JBPriestley, NDAnderson, ACWright, DL Charged Nonclassical Antifolates with Activity Against Gram-Positive and Gram-Negative Pathogens. ACS Med Chem Lett 7:692-6 (2016)  
Target
Name:
Dihydrofolate reductase
Synonyms:
DHFR Dihydrofolate reductase (DHFR) | Tetrahydrofolate dehydrogenase
Type:
Enzyme
Mol. Mass.:
21453.99
Organism:
Homo sapiens (Human)
Description:
Recombinant human DHFR.
Residue:
187
  
Inhibitor
Name:
BDBM210929
Synonyms:
UCP1172
Type:
Small organic molecule
Emp. Form.:
C24H24N4O3
Mol. Mass.:
416.4724
SMILES:
CCc1nc(N)nc(N)c1C#C[C@@H](C)c1cc(OC)cc(c1)-c1ccc(cc1)C(O)=O
: