Target
Protease
Ligand
BDBM50190641
Substrate
Meas. Tech.
ChEBML_1589555
IC50
3.6±n/a nM
Citation
 Bungard, CJWilliams, PDBallard, JEBennett, DJBeaulieu, CBahnck-Teets, CCarroll, SSChang, RKDubost, DCFay, JFDiamond, TLGreshock, TJHao, LHolloway, MKFelock, PJGesell, JJSu, HPManikowski, JJMcKay, DJMiller, MMin, XMolinaro, CMoradei, OMNantermet, PGNadeau, CSanchez, RISatyanarayana, TShipe, WDSingh, SKTruong, VLVijayasaradhi, SWiscount, CMVacca, JPCrane, SNMcCauley, JA Discovery of MK-8718, an HIV Protease Inhibitor Containing a Novel Morpholine Aspartate Binding Group. ACS Med Chem Lett 7:702-7 (2016)  
Target
Name:
Protease
Synonyms:
Type:
Enzyme
Mol. Mass.:
10904.79
Organism:
Human immunodeficiency virus 1 (HIV-1)
Description:
Q9YQ12
Residue:
99
  
Inhibitor
Name:
BDBM50190641
Synonyms:
CHEMBL3827205
Type:
Small organic molecule
Emp. Form.:
C38H41FN4O6
Mol. Mass.:
668.7537
SMILES:
COC(=O)N[C@@H](C(c1ccccc1)c1ccccc1)C(=O)Nc1ccccc1CC[C@@H]1CN[C@H](COC(=O)NCc2ccccc2F)CO1
: