Target
Beta-hexosaminidase subunit alpha
Ligand
BDBM50190644
Substrate
Meas. Tech.
ChEMBL_1611890 (CHEMBL3853690)
IC50
100000±n/a nM
Citation
 de la Fuente, ARísquez-Cuadro, RVerdaguer, XGarcía Fernández, JMNanba, EHigaki, KOrtiz Mellet, CRiera, A Efficient stereoselective synthesis of 2-acetamido-1,2-dideoxyallonojirimycin (DAJNAc) and sp(2)-iminosugar conjugates: Novel hexosaminidase inhibitors with discrimination capabilities between the mature and precursor forms of the enzyme. Eur J Med Chem 121:926-938 (2016)  
Target
Name:
Beta-hexosaminidase subunit alpha
Synonyms:
Beta-N-acetylhexosaminidase subunit alpha HEXA | HEXA_HUMAN
Type:
Protein
Mol. Mass.:
60688.46
Organism:
Homo sapiens (Human)
Description:
P06865
Residue:
529
  
Inhibitor
Name:
BDBM50190644
Synonyms:
CHEMBL3983808
Type:
Small organic molecule
Emp. Form.:
C17H31N3O3S
Mol. Mass.:
357.511
SMILES:
[H][C@]12CS\C(=N/CCCCCCCC)N1C[C@H](NC(C)=O)[C@H](O)[C@@H]2O
: