Target
Iron-starvation protein PigA
Ligand
BDBM50191283
Substrate
Meas. Tech.
ChEMBL_1612785 (CHEMBL3854585)
Kd
6200±n/a nM
Citation
 Heinzl, GAHuang, WYu, WGiardina, BJZhou, YMacKerell, ADWilks, AXue, F Iminoguanidines as Allosteric Inhibitors of the Iron-Regulated Heme Oxygenase (HemO) of Pseudomonas aeruginosa. J Med Chem 59:6929-42 (2016)  
Target
Name:
Iron-starvation protein PigA
Synonyms:
Heme oxygenase | Iron-starvation protein PigA
Type:
PROTEIN
Mol. Mass.:
21946.19
Organism:
Pseudomonas aeruginosa
Description:
ChEMBL_444781
Residue:
198
  
Inhibitor
Name:
BDBM50191283
Synonyms:
Amino(2-(4-Nitrobenzylidene)Hydrazinyl)Methaniminium Chloride | CHEMBL104315
Type:
Small organic molecule
Emp. Form.:
C8H10ClN5O2
Mol. Mass.:
243.65
SMILES:
Cl.NC(=N)N\N=C\c1ccc(cc1)[N+]([O-])=O
: