Target
Iron-starvation protein PigA
Ligand
BDBM50191288
Substrate
Meas. Tech.
ChEMBL_1612785 (CHEMBL3854585)
Kd
8400±n/a nM
Citation
 Heinzl, GAHuang, WYu, WGiardina, BJZhou, YMacKerell, ADWilks, AXue, F Iminoguanidines as Allosteric Inhibitors of the Iron-Regulated Heme Oxygenase (HemO) of Pseudomonas aeruginosa. J Med Chem 59:6929-42 (2016)  
Target
Name:
Iron-starvation protein PigA
Synonyms:
Heme oxygenase | Iron-starvation protein PigA
Type:
PROTEIN
Mol. Mass.:
21946.19
Organism:
Pseudomonas aeruginosa
Description:
ChEMBL_444781
Residue:
198
  
Inhibitor
Name:
BDBM50191288
Synonyms:
CHEMBL3982697
Type:
Small organic molecule
Emp. Form.:
C8H9Cl3N4
Mol. Mass.:
267.543
SMILES:
Cl.[#7]\[#6](-[#7])=[#7]\[#7]=[#6]\c1ccc(Cl)c(Cl)c1
: