Target
DNA polymerase eta
Ligand
BDBM4078
Substrate
Meas. Tech.
ChEMBL_1612839 (CHEMBL3854639)
IC50
62±n/a nM
Citation
 Korzhnev, DMHadden, MK Targeting the Translesion Synthesis Pathway for the Development of Anti-Cancer Chemotherapeutics. J Med Chem 59:9321-9336 (2016)  
Target
Name:
DNA polymerase eta
Synonyms:
POLH RAD30 XPV
Type:
PROTEIN
Mol. Mass.:
78429.67
Organism:
Homo sapiens (Human)
Description:
ChEMBL_1297317
Residue:
713
  
Inhibitor
Name:
BDBM4078
Synonyms:
6,7,13,14-tetrahydroxy-2,9-dioxatetracyclo[6.6.2.0^{4,16}.0^{11,15}]hexadeca-1(14),4(16),5,7,11(15),12-hexaene-3,10-dione ELLAGIC ACID Ellagic acid (18) MLS000069632 cid_5281855
Type:
Small organic molecule
Emp. Form.:
C14H6O8
Mol. Mass.:
302.1926
SMILES:
Oc1cc2c3c(oc(=O)c4cc(O)c(O)c(oc2=O)c34)c1O
: