Target
WD repeat-containing protein 48
Ligand
BDBM50099491
Substrate
Meas. Tech.
ChEMBL_1612850 (CHEMBL3854650)
IC50
5000±n/a nM
Citation
 Korzhnev, DMHadden, MK Targeting the Translesion Synthesis Pathway for the Development of Anti-Cancer Chemotherapeutics. J Med Chem 59:9321-9336 (2016)  
Target
Name:
WD repeat-containing protein 48
Synonyms:
KIAA1449 USP1-associated factor 1 WD repeat endosomal protein WDR48 p80
Type:
PROTEIN
Mol. Mass.:
76215.66
Organism:
Homo sapiens (Human)
Description:
ChEMBL_109642
Residue:
677
  
Inhibitor
Name:
BDBM50099491
Synonyms:
2-(4-(2-(3-cyclohexyl-1-(4-cyclohexylbutyl)ureido)ethyl)phenylthio)-2-methylpropanoic acid CHEMBL21241 cid_3392731
Type:
Small organic molecule
Emp. Form.:
C29H46N2O3S
Mol. Mass.:
502.752
SMILES:
CC(C)(Sc1ccc(CCN(CCCCC2CCCCC2)C(=O)NC2CCCCC2)cc1)C(O)=O
: