Target
Vitamin K-dependent protein C
Ligand
BDBM189434
Substrate
Meas. Tech.
ChEMBL_1612870 (CHEMBL3854670)
Ki
190±n/a nM
Citation
 Zhang, XGlunz, PWJohnson, JAJiang, WJacutin-Porte, SLadziata, VZou, YPhillips, MSWurtz, NRParkhurst, BRendina, ARHarper, TMCheney, DLLuettgen, JMWong, PCSeiffert, DWexler, RRPriestley, ES Discovery of a Highly Potent, Selective, and Orally Bioavailable Macrocyclic Inhibitor of Blood Coagulation Factor VIIa-Tissue Factor Complex. J Med Chem 59:7125-37 (2016)  
Target
Name:
Vitamin K-dependent protein C
Synonyms:
Activated protein C cofactor Apolipoprotein H Blood coagulation factor XIV Coagulation factor V heavy chain Endothelial protein C receptor PROC_HUMAN Vitamin K-dependent protein C precursor
Type:
Enzyme
Mol. Mass.:
52067.73
Organism:
Homo sapiens (Human)
Description:
Residue:
461
  
Inhibitor
Name:
BDBM189434
Synonyms:
US9174974, Example 19
Type:
Small organic molecule
Emp. Form.:
C33H34FN5O5S
Mol. Mass.:
631.717
SMILES:
C[C@H]1COC(=O)Nc2ccc(c(CN(C)C(=O)[C@H](Nc3ccc4c(N)ncc(F)c4c3)c3ccc1c(C)c3)c2)S(=O)(=O)C1CC1
: