Target
5'-AMP-activated protein kinase catalytic subunit alpha-1/subunit beta-1/subunit gamma-1
Ligand
BDBM60978
Substrate
Meas. Tech.
ChEMBL_1612911 (CHEMBL3854711)
Kd
1776±n/a nM
Citation
 Cameron, KOKung, DWKalgutkar, ASKurumbail, RGMiller, RSalatto, CTWard, JWithka, JMBhattacharya, SKBoehm, MBorzilleri, KABrown, JACalabrese, MCaspers, NLCokorinos, EConn, ELDowling, MSEdmonds, DJEng, HFernando, DPFrisbie, RHepworth, DLandro, JMao, YRajamohan, FReyes, ARRose, CRRyder, TShavnya, ASmith, ACTu, MWolford, ACXiao, J Discovery and Preclinical Characterization of 6-Chloro-5-[4-(1-hydroxycyclobutyl)phenyl]-1H-indole-3-carboxylic Acid (PF-06409577), a Direct Activator of Adenosine Monophosphate-activated Protein Kinase (AMPK), for the Potential Treatment of Diabetic Nephropathy. J Med Chem 59:8068-81 (2016)  
Target
Name:
5'-AMP-activated protein kinase catalytic subunit alpha-1/subunit beta-1/subunit gamma-1
Synonyms:
5'-AMP-activated protein kinase Complex 1 AMP-activated protein kinase (AMPK) alpha-1/beta-1/gamma-1 AMPK complex 1 (alpha-1,beta-1,gamma-1) Recombinant AMPK alpha1/beta1/gamma1 complex
Type:
Mol. Mass.:
Description:
Components:
This complex has 0 components.
Component 1
Name:
5'-AMP-activated protein kinase subunit beta-1
Synonyms:
5'-AMP-activated protein kinase subunit beta-1 AMP-activated protein kinase alpha-2/beta-1/gamma-3 AMPK subunit beta-1 PRKAB1
Type:
Mol. Mass.:
30380.94
Organism:
Homo sapiens (Human)
Description:
Q9Y478
Residue:
270
  
Component 2
Name:
5'-AMP-activated protein kinase subunit gamma-1
Synonyms:
5'-AMP-activated protein kinase subunit gamma-1 AMP-activated protein kinase, gamma-1 subunit AMPK gamma-1 AMPK subunit gamma-1 PRKAG1
Type:
Mol. Mass.:
37581.44
Organism:
Homo sapiens (Human)
Description:
P54619
Residue:
331
  
Component 3
Name:
5'-AMP-activated protein kinase catalytic subunit alpha-1
Synonyms:
AAPK1_HUMAN AMP-activated protein kinase alpha-1/beta-2/gamma-2 AMPK subunit alpha-1 AMPK1 PRKAA1 | Tau-protein kinase PRKAA1
Type:
Protein
Mol. Mass.:
64023.62
Organism:
Homo sapiens (Human)
Description:
Q13131
Residue:
559
  
Inhibitor
Name:
BDBM60978
Synonyms:
6-Chloro-5-(4-methoxyphenyl)-1H-indazole-3-carboxylic acid | US9394285, 97
Type:
Emp. Form.:
C15H11ClN2O3
Mol. Mass.:
302.712
SMILES:
COc1ccc(cc1)-c1cc2c(n[nH]c2cc1Cl)C(O)=O
: