Target
D(2) dopamine receptor
Ligand
BDBM50192250
Substrate
Meas. Tech.
ChEMBL_1613478 (CHEMBL3855278)
Ki
468±n/a nM
Citation
 Micheli, FBacchi, ABraggio, SCastelletti, LCavallini, PCavanni, PCremonesi, SDal Cin, MFeriani, AGehanne, SKajbaf, MMarchió, LNola, SOliosi, BPellacani, APerdoną, ESava, ASemeraro, TTarsi, LTomelleri, SWong, AVisentini, FZonzini, LHeidbreder, C 1,2,4-Triazolyl 5-Azaspiro[2.4]heptanes: Lead Identification and Early Lead Optimization of a New Series of Potent and Selective Dopamine D3 Receptor Antagonists. J Med Chem 59:8549-76 (2016)  
Target
Name:
D(2) dopamine receptor
Synonyms:
D(2) dopamine receptor DOPAMINE D2 Long DRD2 Dopamine D2 receptor Dopamine D2 receptor (D2R) Dopamine2-like | d2
Type:
Cell-surface receptors
Mol. Mass.:
50647.10
Organism:
Homo sapiens (Human)
Description:
P14416
Residue:
443
  
Inhibitor
Name:
BDBM50192250
Synonyms:
CHEMBL3895585 | US10239870, Example 240
Type:
Small organic molecule
Emp. Form.:
C22H24F3N5S2
Mol. Mass.:
479.585
SMILES:
Cn1c(SCCCN2CC[C@]3(C[C@H]3c3ccc(cc3)C(F)(F)F)C2)nnc1-c1nccs1
: