Target
D(3) dopamine receptor
Ligand
BDBM50192450
Substrate
Meas. Tech.
ChEMBL_1613477 (CHEMBL3855277)
Ki
0.575440±n/a nM
Citation
 Micheli, FBacchi, ABraggio, SCastelletti, LCavallini, PCavanni, PCremonesi, SDal Cin, MFeriani, AGehanne, SKajbaf, MMarchió, LNola, SOliosi, BPellacani, APerdoną, ESava, ASemeraro, TTarsi, LTomelleri, SWong, AVisentini, FZonzini, LHeidbreder, C 1,2,4-Triazolyl 5-Azaspiro[2.4]heptanes: Lead Identification and Early Lead Optimization of a New Series of Potent and Selective Dopamine D3 Receptor Antagonists. J Med Chem 59:8549-76 (2016)  
Target
Name:
D(3) dopamine receptor
Synonyms:
DOPAMINE D3 DRD3_HUMAN Dopamine D3 receptor (D3) Dopamine receptor Dopamine receptor D3
Type:
Mol. Mass.:
44243.43
Organism:
Homo sapiens (Human)
Description:
Residue:
400
  
Inhibitor
Name:
BDBM50192450
Synonyms:
CHEMBL3896638
Type:
Small organic molecule
Emp. Form.:
C23H25F3N4S2
Mol. Mass.:
478.597
SMILES:
Cn1c(SCCCN2CC[C@]3(C[C@@H]3c3ccc(cc3)C(F)(F)F)C2)nnc1-c1ccsc1
: