Target
Cytochrome P450 2D6
Ligand
BDBM50192750
Substrate
Meas. Tech.
ChEMBL_1613612 (CHEMBL3855412)
IC50
7800±n/a nM
Citation
 Tice, CMNoto, PBFan, KYZhao, WLotesta, SDDong, CMarcus, APZheng, YJChen, GWu, ZVan Orden, RZhou, JBukhtiyarov, YZhao, YLipinski, KHoward, LGuo, JKandpal, GMeng, SHardy, AKrosky, PGregg, RELeftheris, KMcKeever, BMSingh, SBLala, DMcGeehan, GMZhuang, LClaremon, DA Brain penetrant liver X receptor (LXR) modulators based on a 2,4,5,6-tetrahydropyrrolo[3,4-c]pyrazole core. Bioorg Med Chem Lett 26:5044-5050 (2016)  
Target
Name:
Cytochrome P450 2D6
Synonyms:
CP2D6_HUMAN CYP2DL1 Cytochrome P450 2D6 (CYP2D6) P450-DB1
Type:
Protein
Mol. Mass.:
55774.82
Organism:
Homo sapiens (Human)
Description:
P10635
Residue:
497
  
Inhibitor
Name:
BDBM50192750
Synonyms:
CHEMBL3940521
Type:
Small organic molecule
Emp. Form.:
C22H26N4O3S
Mol. Mass.:
426.532
SMILES:
COc1cc(ccn1)N1Cc2cn(nc2[C@H]1C(C)(C)C)-c1cccc(c1)S(C)(=O)=O
: