Target
Coagulation factor X
Ligand
BDBM50192768
Substrate
Meas. Tech.
ChEMBL_1613696 (CHEMBL3855496)
Ki
850±n/a nM
Citation
 Ladziata, VUGlunz, PWZou, YZhang, XJiang, WJacutin-Porte, SCheney, DLWei, ALuettgen, JMHarper, TMWong, PCSeiffert, DWexler, RRPriestley, ES Synthesis and P1' SAR exploration of potent macrocyclic tissue factor-factor VIIa inhibitors. Bioorg Med Chem Lett 26:5051-5057 (2016)  
Target
Name:
Coagulation factor X
Synonyms:
Activated coagulation factor X (FXa) Coagulation factor X precursor F10 Factor X heavy chain Factor Xa Stuart-Prower factor
Type:
Enzyme
Mol. Mass.:
54726.60
Organism:
Homo sapiens (Human)
Description:
Residue:
488
  
Inhibitor
Name:
BDBM50192768
Synonyms:
CHEMBL3900166
Type:
Small organic molecule
Emp. Form.:
C35H36FN5O5
Mol. Mass.:
625.6892
SMILES:
C[C@H]1COC(=O)Nc2ccc(c(CN(C)C(=O)[C@H](Nc3ccc4c(N)ncc(F)c4c3)c3ccc1c(C)c3)c2)C1(CCC1)C(O)=O
: