Target
Peroxisome proliferator-activated receptor delta
Ligand
BDBM50192837
Substrate
Meas. Tech.
ChEMBL_1613916 (CHEMBL3855716)
EC50
1.6±n/a nM
Citation
 Blass, B PPAR Agonists, Compounds, Pharmaceutical Compositions, and Methods of Use Thereof. ACS Med Chem Lett 7:824-5 (2016)  
Target
Name:
Peroxisome proliferator-activated receptor delta
Synonyms:
NR1C2 NUCI Nuclear receptor subfamily 1 group C member 2 PPAR-beta PPARD Peroxisome proliferator-activated receptor Peroxisome proliferator-activated receptor delta
Type:
Enzyme
Mol. Mass.:
49910.45
Organism:
Homo sapiens (Human)
Description:
Q03181
Residue:
441
  
Inhibitor
Name:
BDBM50192837
Synonyms:
CHEMBL3964816 | US10188627, Compound 8d
Type:
Small organic molecule
Emp. Form.:
C26H26ClNO5
Mol. Mass.:
467.941
SMILES:
CN(Cc1ccccc1OC\C=C(/C)CCC(O)=O)C(=O)c1ccc(-c2ccco2)c(Cl)c1
: