Target
Phosphatidylinositol 4,5-bisphosphate 3-kinase catalytic subunit gamma isoform
Ligand
BDBM50192880
Substrate
Meas. Tech.
ChEMBL_1613934 (CHEMBL3855734)
IC50
1.2±n/a nM
Citation
 Evans, CALiu, TLescarbeau, ANair, SJGrenier, LPradeilles, JAGlenadel, QTibbitts, TRowley, AMDiNitto, JPBrophy, EEO'Hearn, ELAli, JAWinkler, DGGoldstein, SIO'Hearn, PMartin, CMHoyt, JGSoglia, JRCheung, CPink, MMProctor, JLPalombella, VJTremblay, MRCastro, AC Discovery of a Selective Phosphoinositide-3-Kinase (PI3K)-¿ Inhibitor (IPI-549) as an Immuno-Oncology Clinical Candidate. ACS Med Chem Lett 7:862-7 (2016)  
Target
Name:
Phosphatidylinositol 4,5-bisphosphate 3-kinase catalytic subunit gamma isoform
Synonyms:
PI3-kinase subunit gamma PI3Kgamma Phosphatidylinositol 3-kinase p110γ (p110γ) Phosphatidylinositol 4,5-bisphosphate 3-kinase catalytic subunit gamma isoform Pi3kg1 PtdIns-3-kinase subunit gamma Serine/threonine protein kinase PIK3CG p120-PI3K
Type:
Enzyme
Mol. Mass.:
126411.77
Organism:
Mus musculus (Mouse)
Description:
Q9JHG7
Residue:
1102
  
Inhibitor
Name:
BDBM50192880
Synonyms:
CHEMBL3984425 US10675286, Compound 110 US9775844, Compound 4
Type:
Small organic molecule
Emp. Form.:
C30H24N8O2
Mol. Mass.:
528.564
SMILES:
C[C@H](NC(=O)c1c(N)nn2cccnc12)c1cc2cccc(C#Cc3cnn(C)c3)c2c(=O)n1-c1ccccc1
: