Target
E3 ubiquitin-protein ligase SMURF1
Ligand
BDBM239101
Substrate
Meas. Tech.
ChEBML_1614090
IC50
0.900000±n/a nM
Citation
 Abdel-Magid, AF Therapeutic Potential of Smurf-1 Inhibitors for the Treatment of Pulmonary Arterial Hypertension (PAH). ACS Med Chem Lett 7:878-880 (2016)  
Target
Name:
E3 ubiquitin-protein ligase SMURF1
Synonyms:
E3 ubiquitin-protein ligase SMURF1 KIAA1625 SMAD-specific E3 ubiquitin-protein ligase 1 SMURF1 | hSMURF1
Type:
PROTEIN
Mol. Mass.:
86120.64
Organism:
Homo sapiens (Human)
Description:
ChEMBL_116984
Residue:
757
  
Inhibitor
Name:
BDBM239101
Synonyms:
US10195181, Example 2.2 | US9403810, 2.2
Type:
Small organic molecule
Emp. Form.:
C24H34N4O3
Mol. Mass.:
426.5518
SMILES:
Cc1c(noc1C1=CCC(C)(C)CC1)C(=O)Nc1c(C)n(C)n(C2CCCCC2)c1=O
: