Target
Alpha-2B adrenergic receptor
Ligand
BDBM50027031
Substrate
Meas. Tech.
ChEMBL_1614153 (CHEMBL3855953)
EC50
776±n/a nM
Citation
 Giusepponi, MECifani, CMicioni Di Bonaventura, MVMattioli, LHudson, ADiamanti, EDel Bello, FGiannella, MMammoli, VPaoletti, CDPiergentili, APigini, MQuaglia, W Combined Interactions with I ACS Med Chem Lett 7:956-961 (2016)  
Target
Name:
Alpha-2B adrenergic receptor
Synonyms:
ADA2B_HUMAN ADRA2L1 Adrenergic alpha2B Adrenergic receptor alpha Alpha-2 adrenergic receptor subtype C2 Alpha-2B adrenoreceptor | Alpha-2BAR
Type:
Enzyme
Mol. Mass.:
49964.20
Organism:
Homo sapiens (Human)
Description:
P18089
Residue:
450
  
Inhibitor
Name:
BDBM50027031
Synonyms:
(2-Chloro-phenyl)-(4,5-dihydro-1H-imidazol-2-ylmethyl)-amine | CHEMBL51358
Type:
Small organic molecule
Emp. Form.:
C10H12ClN3
Mol. Mass.:
209.675
SMILES:
Clc1ccccc1NCC1=NCCN1
: