Target
NAD-dependent protein deacetylase sirtuin-1
Ligand
BDBM50193077
Substrate
Meas. Tech.
ChEMBL_1614242 (CHEMBL3856311)
EC50
<1000±n/a nM
Citation
 Kumar, AChauhan, S How much successful are the medicinal chemists in modulation of SIRT1: A critical review. Eur J Med Chem 119:45-69 (2016)  
Target
Name:
NAD-dependent protein deacetylase sirtuin-1
Synonyms:
NAD-Dependent Deacetylase Sirtuin-1 NAD-dependent protein deacetylase sirtuin-1 (SIRT1) SIR2-like protein 1 SIRT1 Sirtuin-1 (SIRT1) | hSIR2
Type:
Developmental protein; hydrolase
Mol. Mass.:
81626.66
Organism:
Homo sapiens (Human)
Description:
Residue:
747
  
Inhibitor
Name:
BDBM50193077
Synonyms:
CHEMBL3941013
Type:
Small organic molecule
Emp. Form.:
C22H15FN4O2S
Mol. Mass.:
418.444
SMILES:
Nc1c(c2nc3ccccc3nc2n1-c1ccc(F)cc1)S(=O)(=O)c1ccccc1
: