Target
Steryl-sulfatase
Ligand
BDBM50168219
Substrate
Meas. Tech.
ChEMBL_1614316 (CHEMBL3856385)
IC50
0.050000±n/a nM
Citation
 Ouellet, CMaltais, ROuellet, ÉBarbeau, XLagüe, PPoirier, D Discovery of a sulfamate-based steroid sulfatase inhibitor with intrinsic selective estrogen receptor modulator properties. Eur J Med Chem 119:169-82 (2016)  
Target
Name:
Steryl-sulfatase
Synonyms:
ARSC1 Arylsulfatase C STS_HUMAN Steryl-sulfate sulfohydrolase
Type:
Enzyme
Mol. Mass.:
65503.66
Organism:
Homo sapiens (Human)
Description:
P08842
Residue:
583
  
Inhibitor
Name:
BDBM50168219
Synonyms:
CHEMBL3805209
Type:
Small organic molecule
Emp. Form.:
C26H33NO5S
Mol. Mass.:
471.609
SMILES:
[H][C@@]12CC[C@@](O)(Cc3ccccc3)[C@@]1(C)CC[C@]1([H])c3cc(OC)c(OS(N)(=O)=O)cc3CC[C@@]21[H]
: