Target
Cyclin-dependent kinase 4
Ligand
BDBM50193090
Substrate
Meas. Tech.
ChEMBL_1614481 (CHEMBL3856550)
Ki
>1000±n/a nM
Citation
 Sonawane, YATaylor, MANapoleon, JVRana, SContreras, JINatarajan, A Cyclin Dependent Kinase 9 Inhibitors for Cancer Therapy. J Med Chem 59:8667-8684 (2016)  
Target
Name:
Cyclin-dependent kinase 4
Synonyms:
CDK4 Cell division protein kinase 4 PSK-J3
Type:
Enzyme Subunit
Mol. Mass.:
33731.96
Organism:
Homo sapiens (Human)
Description:
P11802
Residue:
303
  
Inhibitor
Name:
BDBM50193090
Synonyms:
CHEMBL3895785
Type:
Small organic molecule
Emp. Form.:
C18H17FN4O3S
Mol. Mass.:
388.416
SMILES:
COc1ccccc1-c1cc(Nc2ccc(F)c(NS(C)(=O)=O)c2)ncn1
: