Target
Focal adhesion kinase 1
Ligand
BDBM50193823
Substrate
Meas. Tech.
ChEMBL_1616175 (CHEMBL3858244)
IC50
2.4±n/a nM
Citation
 Ott, GRCheng, MLearn, KSWagner, JGingrich, DELisko, JGCurry, MMesaros, EFGhose, AKQuail, MRWan, WLu, LDobrzanski, PAlbom, MSAngeles, TSWells-Knecht, KHuang, ZAimone, LDBruckheimer, EAnderson, NFriedman, JFernandez, SVAtor, MARuggeri, BADorsey, BD Discovery of Clinical Candidate CEP-37440, a Selective Inhibitor of Focal Adhesion Kinase (FAK) and Anaplastic Lymphoma Kinase (ALK). J Med Chem 59:7478-96 (2016)  
Target
Name:
Focal adhesion kinase 1
Synonyms:
FADK 1 FAK1 FLT4 Focal adhesion kinase (FAK) Focal adhesion kinase 1 (FAK) Focal adhesion kinase-related nonkinase PTK2 Protein-tyrosine kinase 2 p125FAK | pp125FAK
Type:
Tyrosine-protein kinase
Mol. Mass.:
119233.17
Organism:
Homo sapiens (Human)
Description:
Q05397
Residue:
1052
  
Inhibitor
Name:
BDBM50193823
Synonyms:
CHEMBL3934268
Type:
Small organic molecule
Emp. Form.:
C30H40ClN7O4S
Mol. Mass.:
630.201
SMILES:
COc1c(Nc2ncc(Cl)c(Nc3ccccc3N(C)S(C)(=O)=O)n2)ccc2CC(CCCc12)N1CCN(CCO)CC1
: