Target
Cytochrome P450 2D6
Ligand
BDBM50193810
Substrate
Meas. Tech.
ChEMBL_1616180 (CHEMBL3858249)
IC50
>5600±n/a nM
Citation
 Ott, GRCheng, MLearn, KSWagner, JGingrich, DELisko, JGCurry, MMesaros, EFGhose, AKQuail, MRWan, WLu, LDobrzanski, PAlbom, MSAngeles, TSWells-Knecht, KHuang, ZAimone, LDBruckheimer, EAnderson, NFriedman, JFernandez, SVAtor, MARuggeri, BADorsey, BD Discovery of Clinical Candidate CEP-37440, a Selective Inhibitor of Focal Adhesion Kinase (FAK) and Anaplastic Lymphoma Kinase (ALK). J Med Chem 59:7478-96 (2016)  
Target
Name:
Cytochrome P450 2D6
Synonyms:
CP2D6_HUMAN CYP2DL1 Cytochrome P450 2D6 (CYP2D6) P450-DB1
Type:
Protein
Mol. Mass.:
55774.82
Organism:
Homo sapiens (Human)
Description:
P10635
Residue:
497
  
Inhibitor
Name:
BDBM50193810
Synonyms:
CHEMBL3972653
Type:
Small organic molecule
Emp. Form.:
C30H38ClN7O3
Mol. Mass.:
580.121
SMILES:
CNC(=O)c1ccccc1Nc1nc(Nc2ccc3C[C@@H](CCCc3c2OC)N2CCN(CCO)CC2)ncc1Cl
: