Target
Prostaglandin E synthase
Ligand
BDBM50194137
Substrate
Meas. Tech.
ChEMBL_1616436 (CHEMBL3858505)
IC50
23±n/a nM
Citation
 Kuklish, SLAntonysamy, SBhattachar, SNChandrasekhar, SFisher, MJFretland, AJGooding, KHarvey, AHughes, NELuz, JGManninen, PRMcGee, JENavarro, ANorman, BHPartridge, KMQuimby, SJSchiffler, MASloan, AVWarshawsky, AMYork, JSYu, XP Characterization of 3,3-dimethyl substituted N-aryl piperidines as potent microsomal prostaglandin E synthase-1 inhibitors. Bioorg Med Chem Lett 26:4824-4828 (2016)  
Target
Name:
Prostaglandin E synthase
Synonyms:
MGST1L1 PGES PTGES Prostaglandin E synthase (PGES-1) Prostaglandin E synthase-1 (PGES-1) Prostaglandin E2 synthase-1 ( mPGES-1)
Type:
Protein
Mol. Mass.:
17112.22
Organism:
Homo sapiens (Human)
Description:
Residue:
152
  
Inhibitor
Name:
BDBM50194137
Synonyms:
CHEMBL3922684
Type:
Small organic molecule
Emp. Form.:
C24H32ClN3O2
Mol. Mass.:
429.983
SMILES:
CC1(C)CN(CC[C@@H]1C(=O)N[C@@H]1CC[C@H](CO)CC1)c1ccc2cccc(Cl)c2n1
: