Target
Chromodomain Y-like protein 2
Ligand
BDBM50194263
Substrate
Meas. Tech.
ChEMBL_1616627 (CHEMBL3858696)
IC50
1000±n/a nM
Citation
 Stuckey, JISimpson, CNorris-Drouin, JLCholensky, SHLee, JPasca, RCheng, NDickson, BMPearce, KHFrye, SVJames, LI Structure-Activity Relationships and Kinetic Studies of Peptidic Antagonists of CBX Chromodomains. J Med Chem 59:8913-8923 (2016)  
Target
Name:
Chromodomain Y-like protein 2
Synonyms:
CDY-like 2 CDYL2_HUMAN | Chromodomain Y-like protein 2
Type:
PROTEIN
Mol. Mass.:
56517.92
Organism:
Homo sapiens (Human)
Description:
ChEMBL_116982
Residue:
506
  
Inhibitor
Name:
BDBM50194263
Synonyms:
CHEMBL3970021
Type:
Small organic molecule
Emp. Form.:
C40H60N7O9
Mol. Mass.:
782.9454
SMILES:
COC(=O)[C@H](CO)NC(=O)[C@H](CCCC[N+](C)(C)C)NC(=O)[C@H](CC(C)C)NC(=O)[C@H](C)NC(=O)[C@H](Cc1ccccc1)NC(=O)CNC(=O)c1ccccc1
: